Carimbodedatahora,VoceconcordacomostermosexpostosnoTCLEacima,VoceentregouumaviadoTCLEaopacienteemanteveumaviaassi_A,VoceentregouumaviadoTCLEaopacienteemanteveumaviaassi,OpacienteemquestaoeSUSPEITOouCONFIRMADOparaCOVID19,IdentificacaodopacientePreenchaestecampocomasIniciaisd,RGCT,CidadeeEstadoAtual,Estado,Regiaodopais,IniciaisdoPaciente,Sexodoreceptor,Datadenascimentodoreceptor,idadereceptor,≥60,Etniadoreceptor,PesodoReceptornomomentodotransplantekg,Alturadoreceptornomomentodotransplantecm,IMCdoreceptornomomentodotransplante,Motivoparaotransplantehepaticomarquetodasqueseenquadra,Datadotransplante,Tempo_Desde_TX,Tempo_Desde_TX_Months,LocaldoTransplanteHospitalEquipe,AntecedentesPessoaisdoReceptormarquetodosospresentes,Usodemedicacoesantihipertensivas,Tabagismoatualouprevio,Cardiopatia,Diabetes,Dislipidemia,Doenca_Autoimune,DRC,Hipertensao,Hipotireoidismo,Neoplasia_atual_ou_pregressa,Pneumopatia_previa,Transplante_renal_previo,Obesity,Charlson,SintomassugestivosdeCOVIDmarquetodosospresentes,Nauseas_vomito,Odinofagia,Sinais_neurologicos,Tosse,Artralgia,Dor_abdominal,Espirros,Espectoracao,Adinamia,Outros,Fadiga,Alt_olfato,Febre,Mialgia,Alt_paladar,Anorexia,Assintomatico,Calafrios,Cefaleia,Congestao_nasal,Coriza,Diarreia,Dispneia,Dor_toracica,SinaisesintomasdeCOVID19quesurgiramnaevolucaodadoenca,Datadoiniciodossintomas,Dataemqueopacientebuscouservicosdesaude,Tempo_busca_SV_Saude,Tempo_para_testagem_COVID,Tempo_entre_sintomas_e_internacao,DatadarealizacaodotesteconfirmatorioCOVID19,Onda_COVID,Datadainternacao,KAPLANMEIER_T_Sintoma_ate_obito,KAPLANMEIER_T_Diag_ate_obito,TestesrealizadosparaCOVID,Tratamento,UTI,NumerodediasemUTICTIsenaohouveinternacaoemUTImar,Numerodediasemintubacaoorotraquealsenaohouveintubacao,Tempoentreiniciodossintomasecomecodotratamentodias,TempodetratamentocomterapiasespecificasparaCOVID19dias,Patient_Death,DesfechoPrincipaldopaciente,DatadoObitosepacientevivonaopreencher,Tempo_de_seguimento_dias,Necessidadedeventilacaomecanicanainternacao,Datadaintubacaoorotraquealsenaohouveintubacaonaopreen,Necessidadedehemodialiseainternacao,TAC,MFS,EVR,PRED,AZA,CsA,SIROLIMUS,Regimedeimunossupressao,ComoforamconduzidososimunossupressoresduranteadoencaMa,TAC_Reduction,TAC_Suspension,MFS_Reduction,MFS_Suspension,EVR_Reduction,EVR_Suspension,PRED_Reduction,PRED_Suspension,AZA_Reduction,AZA_Suspension,CsA_Reduction,CsA_Suspension,SIROLIMUS_Reduction,SIROLIMUS_Suspension,Com_vs_sem_alt_imunossupressao,ForaminstituidostratamentosespecificosparaCOVID19,Com_vs_sem_tratamento,UsodeterapiacomcorticoesteroidesaodiagnosticodeCOVID19,Com_vs_sem_CTC_previo,Perdadoenxertonos3mesesaposresolucaodainfeccao,Casotenhaocorridoperdadoenxertomarqueadatadaperda,Opacienteapresentasequelaspulmonares3mesesaposresolucao,Opacientefoiaobitonos3mesesaposaresolucaodainfeccao,DIVISOR_INTERNACAO,AnormalidadesvisualizadasemRaioXdetorax,RX_alt_SN,Anormalidadesdetectadasnatomografia,CT_alt_SN,HemogramaContagemdelinfocitostotaiseporcentagem,HemogramaHemoglobinaaadmissaogdL,HemogramaContagemPlaquetasaadmissaocelsÂµL,DosagemdeProteinaCreativaPCRaadmissao,DosagemdeTGOASTaadmissao,DosagemdeTGPALTaadmissao,Dosagemdebilirrubinaaadmissao,DosagemdeFosfataseAlcalinaFALCaadmissao,DosagemdeGamaGTGGTaadmissao,Dosagemdealbuminaaadmissao,DosagemdeRNIINRaadmissao,ValordeCreatininabasalmediadosultimos3valoresdecreati,ValordeSodiosericoaadmissao,ValordeTroponinaaadmissao,ValordeDdimeroaadmissao,Coinfeccao_Admissao,NiveldeimunosupressaongmLCyaFKEVRMMF,Presencadeasciteaadmissao,Presencadeencefalopatiaaadmissao,DIVISIOR___DOADOR,IdadedoDoador,SexodoDoador,DatadaMorteEncefalicadoDoador,Pesododoadorkg,Alturadodoadorcentimetros,TempodeUTIdodoadordias,DoadorfoiinternadoemquetipodeUTI,CausadaMorteEncefalicadoDoador,Usodedrogasvasoativaspelodoador,Sinaisdedoencainfecciosanodoador,Sinaisdeinfeccaorespiratorianodoador,Tomografiadetoraxdodoador,SaturacaoO2doador,DoadorcoletouSorologiaCOVID19,DoadorcoletouPCRSwabNasalparaCOVID19,QualdosexamescolhidosforneceuresultadopositivoparaCOVID,TGOASTdoador,TGPALTDoador,BilirrubinaDoadormgdL,FosfataseAlcalinadodoadorFALC,GamaglutamiltransferasedodoadorGGT,AlbuminadodoadorgdL,RNIINRdoador,DIVISOR___ALTA,Datadaaltahospitalarcasotenhaocorrido,PacienterealizoutestecomSwabnasalparacontroledecurae,CasopacientetenharealizadoSwabparacontroledecurainseri,NumerodeSwabsdecurarealizados,PacienterealizousorologiaELISAparacontroledecura,Creatininasericadaalta,Creatininaserica3mesesaposaalta,Pacienteapresentaascite3mesesaposainfeccao,Pacienteapresentaencefalopatia3mesesaposainfeccao,ValordeTGOAST3mesesaposresolucaodainfeccao,ValordeTGPALT3mesesaposresolucaodainfeccao,ValordeBilirrubina3mesesaposresolucaodainfeccao,ValordeFosfataseAlcalinaFALC3mesesaposresolucaodainf,ValordeGamaGTGGT3mesesaposresolucaodainfeccao,filter_$
2021-08-12,Sim,,Sim,Confirmado,IMIP-06-GSC,252813-2620,Recife-PE,PE,Nordeste,GSC,Male,1960-06-29,61.0,1.0,White,76.0,162.0,28.96,Hepatite / Cirrose Alcoolica,2020-06-26,1.1279945242984257,13.535934291581109,Instituto de Medicina Integral de Pernambuco,Hipertensao,Nao usava,,0.0,0.0,0.0,0.0,0.0,1.0,0.0,0.0,0.0,0.0,0.0,1.0,Dispneia/ Hipoxemia,0.0,0.0,0.0,0.0,0.0,0.0,0.0,0.0,0.0,0.0,0.0,0.0,0.0,0.0,0.0,0.0,0.0,0.0,0.0,0.0,0.0,0.0,1.0,0.0,"Dispneia, Hipoxemia, entubacao e parada cardiorrespiratoria",2020-07-02,2020-06-25,-7.0,3.0,-10.0,2020-07-05,1.0,2020-06-25,2.0,438.0,PCR-Swab Nasal,Inpatient,1.0,1.0,1.0,,0.0,1.0,2.0,2020-07-04,9.0,Sim - sem pronacao,2020-07-03,Sim,1.0,1.0,0.0,0.0,0.0,0.0,0.0,TAC-MFS,"Reducao de inibidores de Calcineurina (TAC, CsA), Suspensao MMF, mantido",1.0,0.0,0.0,1.0,,,,,,,,,,,1.0,,0.0,Sim,1.0,,,,,,Anormalidades intersticiais,1.0,"Opacidades em vidro fosco, Consolidacoes bilaterais, Anormalidades intersticiais",1.0,-8,,64000.0,137.0,915.0,975.0,,159.0,299.0,,,,131.0,,,Sim,,Nao,Nao,,35.0,Masculino,2020-06-25,85.0,165.0,2.0,UTI geral,TCE,Nao,Não,Sim,Nao realizada,,Nao,Sim,,94.0,26.0,,57.0,30.0,,,,,Nao,,,,,,,,,,,,,1.0
2021-06-23,Sim,,Sim,Confirmado,ICDF-07-EMS,2665625320,"BRASILIA, DF",DF,Centro-Oeste / DF,EMS,Male,1963-04-27,58.0,0.0,Mixed race,,,,"Carcinoma Hepatocelular  (CHC), NASH",2021-02-19,0.3394934976043806,4.073921971252567,ICDF,"Hipertensao, Diabetes Mellitus Tipo 1 ou Tipo 2","Bloqueadores do receptor AT2 (Losartan, Valsartan)",Ex-smoker,0.0,1.0,0.0,0.0,0.0,1.0,0.0,0.0,0.0,0.0,,2.0,Dispneia,0.0,0.0,0.0,0.0,0.0,0.0,0.0,0.0,0.0,0.0,0.0,0.0,0.0,0.0,0.0,0.0,0.0,0.0,0.0,0.0,0.0,0.0,1.0,0.0,,2021-04-16,,,0.0,-56.0,2021-04-16,2.0,2021-02-19,22.0,22.0,PCR-Swab Nasal,Inpatient,0.0,0.0,,6.0,6.0,1.0,2.0,2021-05-08,,Nao,,Sim,1.0,1.0,0.0,1.0,0.0,0.0,0.0,TAC-MFS-PRED,"Reducao de inibidores de Calcineurina (TAC, CsA), Suspensao MMF",1.0,0.0,0.0,1.0,,,0.0,0.0,,,,,,,1.0,Cortico-esteroides em altas doses,1.0,Sim,1.0,,,,,,Nao realizou radiografia de torax / Nao informado,,Opacidades em vidro fosco,1.0,,,,24.0,19.0,11.0,,,36.0,,,,,,,Sim,,Nao informado,Nao informado,,49.0,Masculino,2021-02-18,90.0,175.0,,UTI geral,AVC (hemorragico ou isquemico),,,,Nao realizada,,Nao,Nao,,,,,,,,,,,Nao,,,Nao,,,,,,,,,,1.0
2021-07-30,Sim,,Sim,Confirmado,HL - EAE,269031-5,RIO BRANCO - AC,AC,Sudeste,EAE,Female,1980-06-17,41.0,0.0,Mixed race,106.0,166.0,38.47,Hepatite fulminante,2020-08-03,0.9883641341546886,11.860369609856264,H Leforte,Obesidade,Nao usava,No,0.0,0.0,0.0,0.0,0.0,0.0,0.0,0.0,0.0,0.0,1.0,1.0,Cefaleia/ Artralgia,0.0,0.0,0.0,0.0,1.0,0.0,0.0,0.0,0.0,0.0,0.0,0.0,0.0,0.0,0.0,0.0,0.0,0.0,1.0,0.0,0.0,0.0,0.0,0.0,"Cefaleia, Artralgia, INAPETENCIA",2021-02-18,2021-02-18,0.0,0.0,,2021-02-18,2.0,,210.0,210.0,PCR-Swab Nasal,Outpatient,,0.0,,,14.0,0.0,1.0,,162.0,Paciente nao foi internado,,Paciente nao foi internado,1.0,1.0,0.0,0.0,0.0,0.0,0.0,TAC-MFS,"Reducao de inibidores de Calcineurina (TAC, CsA), Suspensao MMF",1.0,0.0,0.0,1.0,,,,,,,,,,,1.0,"Cortico-esteroides em altas doses, Vitamina C, Vitamina D",1.0,Nao,0.0,Nao,,Nao,Nao,,Nao realizou radiografia de torax / Nao informado,,Nao realizou Tomografia de torax / Nao informado,,,,,,,,,,,,,,,,,Nao,13.0,Nao,Nao,,39.0,Feminino,2020-08-03,65.0,165.0,3.0,UTI geral,AVC (hemorragico ou isquemico),Sim,Não,Nao,Nao realizada,100.0,Nao,Sim,,12.0,8.0,,53.0,16.0,,,,,Sim,23/03/2021,1.0,Nao,,1.0,Nao,Nao,26.0,32.0,,56.0,110.0,1.0
2021-05-19,Sim,,Sim,Confirmado,HSV-04-MGN,252145-4120,"CURITIBA, PR",PR,Sul,MGN,Female,1951-12-07,69.0,1.0,White,60.0,160.0,23.44,NASH,2020-05-21,0.9938398357289527,11.926078028747433,HOSPITAL SAO VICENTE,"Hipertensao, Diabetes Mellitus Tipo 1 ou Tipo 2, Obesidade","Inibidores da ECA (Captopril, enalapril, ramipril)",No,0.0,1.0,0.0,0.0,0.0,1.0,0.0,0.0,0.0,0.0,0.0,3.0,Dispneia,0.0,0.0,0.0,0.0,0.0,0.0,0.0,0.0,0.0,0.0,0.0,0.0,0.0,0.0,0.0,0.0,0.0,0.0,0.0,0.0,0.0,0.0,1.0,0.0,"Febre, Dispneia",2020-05-29,2020-05-29,0.0,11.0,-11.0,2020-06-09,1.0,2020-05-29,475.0,464.0,PCR-Swab Nasal,Inpatient,0.0,0.0,,1.0,0.0,0.0,1.0,,355.0,Nao,,Nao,1.0,1.0,0.0,0.0,0.0,0.0,0.0,TAC-MFS,"Reducao de inibidores de Calcineurina (TAC, CsA), Suspensao MMF",1.0,0.0,0.0,1.0,,,,,,,,,,,1.0,"Cortico-esteroides em altas doses, Heparina",1.0,Sim,1.0,Nao,,Nao,Nao,,Nao realizou radiografia de torax / Nao informado,,Opacidades em vidro fosco,1.0,1068-12,,136000.0,104.0,20.0,27.0,,129.0,99.0,,,,133.0,0.0,,Nao,,Nao,Nao,,37.0,Masculino,2020-05-20,89.0,178.0,9.0,UTI geral,TCE,Sim,Sim,Nao,Nao realizada,94.0,Nao,Sim,,35.0,42.0,,85.0,179.0,,,,2020-06-23,Nao,,,,,,Nao,Nao,108.0,56.0,,46.0,55.0,1.0
2021-05-19,Sim,,Sim,Confirmado,HSV-06-AC,226830-4120,"CURITIBA, PR",PR,Sul,AC,Male,1952-01-10,69.0,1.0,White,68.0,168.0,24.09,Hepatite / Cirrose Alcoolica,2020-05-15,1.0102669404517455,12.123203285420944,HOSPITAL SAO VICENTE,,Nao usava,No,0.0,0.0,0.0,0.0,0.0,0.0,0.0,0.0,0.0,0.0,0.0,0.0,Febre/ Tosse/ Fadiga,0.0,0.0,0.0,1.0,0.0,0.0,0.0,0.0,0.0,0.0,1.0,0.0,1.0,0.0,0.0,0.0,0.0,0.0,0.0,0.0,0.0,0.0,0.0,0.0,"Febre, Tosse, Fadiga, Mialgia",2020-06-11,2020-06-11,0.0,8.0,-8.0,2020-06-19,1.0,2020-06-11,462.0,454.0,PCR-Swab Nasal,Inpatient,0.0,0.0,,3.0,7.0,0.0,1.0,,342.0,Nao,,Nao,1.0,1.0,0.0,0.0,0.0,0.0,0.0,TAC-MFS,"Reducao de inibidores de Calcineurina (TAC, CsA), Suspensao MMF",1.0,0.0,0.0,1.0,,,,,,,,,,,1.0,"Cortico-esteroides em altas doses, Heparina",1.0,Sim,1.0,Nao,,Nao,Nao,,Nao realizou radiografia de torax / Nao informado,,Opacidades em vidro fosco,1.0,644-7,,159000.0,,40.0,85.0,,214.0,577.0,,,,147.0,,,Nao,9.0,Nao,Nao,,27.0,Feminino,2020-05-14,100.0,167.0,8.0,UTI geral,Anoxia Cerebral,Nao,Sim,Sim,Nao realizada,98.0,Nao,Sim,,57.0,58.0,,68.0,101.0,,,,2020-06-05,Nao,,,Nao,,,Nao,Nao,30.0,18.0,,51.0,65.0,1.0
2021-01-26,Sim,,Sim,Confirmado,HLL-MAW-5180446,259439-5,"Sao Paulo, SP",SP,Sudeste,MAW,Male,1959-01-19,62.0,1.0,White,83.0,163.0,31.24,Hepatite / Cirrose Alcoolica,2020-04-29,0.7446954140999316,8.936344969199178,H Leforte,"Hipertensao, Obesidade, Dislipidemia",Nao usava,Ex-smoker,0.0,0.0,1.0,0.0,0.0,1.0,0.0,0.0,0.0,0.0,1.0,3.0,Febre/ Tosse/ Alteracao do paladar,0.0,0.0,0.0,1.0,0.0,0.0,0.0,0.0,0.0,0.0,0.0,0.0,1.0,0.0,1.0,0.0,0.0,0.0,0.0,0.0,0.0,0.0,0.0,0.0,"Febre, Alteracao do paladar",2020-05-18,2020-05-20,2.0,2.0,0.0,2020-05-20,1.0,2020-05-20,57.0,55.0,PCR-Swab Nasal,Inpatient,1.0,16.0,,2.0,0.0,1.0,2.0,2020-07-14,55.0,Sim - sem pronacao,2020-05-22,,1.0,1.0,0.0,0.0,0.0,0.0,0.0,TAC-MFS,"Reducao de inibidores de Calcineurina (TAC, CsA), Suspensao MMF",1.0,0.0,0.0,1.0,,,,,,,,,,,1.0,"Cortico-esteroides em altas doses, Heparina, Oseltamivir",1.0,Sim,1.0,,,,,,Consolidacoes bilaterais,1.0,Opacidades em vidro fosco,1.0,6620,,265.0,,33.0,41.0,,0.0,0.0,0.0,,,132.0,0.0,,Nao,,Sim,Nao,,54.0,Feminino,2020-04-28,85.0,165.0,2.0,UTI geral,AVC (hemorragico ou isquemico),Sim,Não,Nao,Nao realizada,98.0,Nao,Sim,PCR,40.0,15.0,,63.0,16.0,0.0,0.0,,,Nao,,,Nao,,,,,,,,,,1.0
2021-01-24,Sim,,Sim,Confirmado,HQD-5-CRCM,214718-3320,"Rio de Janeiro, RJ",RJ,Sudeste,CRCM,Male,1956-08-15,65.0,1.0,Mixed race,89.0,160.0,34.77,"Hepatite C, Carcinoma Hepatocelular  (CHC)",2018-10-29,2.239561943874059,26.874743326488705,HQD,Hipotireoidismo,Nao usava,No,0.0,0.0,0.0,0.0,0.0,0.0,1.0,0.0,0.0,0.0,1.0,1.0,Febre/ Tosse,0.0,0.0,0.0,1.0,0.0,0.0,0.0,0.0,0.0,0.0,0.0,0.0,1.0,0.0,0.0,0.0,0.0,0.0,0.0,0.0,0.0,0.0,0.0,0.0,"Febre, Tosse, Dispneia",2020-06-20,2020-06-23,3.0,3.0,10.0,2020-06-23,1.0,2020-07-03,37.0,34.0,PCR-Swab Nasal,Inpatient,1.0,14.0,18.0,13.0,24.0,1.0,2.0,2020-07-27,34.0,Sim - com pronacao,2020-07-10,Sim,1.0,1.0,0.0,0.0,0.0,0.0,0.0,TAC-MFS,"Reducao de inibidores de Calcineurina (TAC, CsA), Suspensao MMF",1.0,0.0,0.0,1.0,,,,,,,,,,,1.0,Cortico-esteroides em altas doses,1.0,Nao,0.0,,,,,,Nao realizou radiografia de torax / Nao informado,,Opacidades em vidro fosco,1.0,174 - 6,,131000.0,,108.0,75.0,,107.0,171.0,,,,140.0,12.0,341.0,Sim,,Nao,Nao,,24.0,Masculino,2018-10-28,100.0,180.0,3.0,UTI geral,TCE,Sim,Não,Nao,Nao realizada,,Nao,Nao,,37.0,20.0,,95.0,15.0,,,,,Nao,,,Nao,,,,,,,,,,1.0
2021-03-30,Sim,,Sim,Confirmado,HUWC-HSC- 16 - RPC,200942-2320,"Fortaleza, CE",CE,Nordeste,RPC,Male,1949-05-30,72.0,1.0,Mixed race,82.0,176.0,26.47,"Hepatite C, Ascite Refrataria",2018-05-29,2.836413415468857,34.03696098562629,HUWC/UFC,"Diabetes Mellitus Tipo 1 ou Tipo 2, Hipotireoidismo, DRC",Nao usava,Ex-smoker,0.0,1.0,0.0,0.0,1.0,0.0,1.0,0.0,0.0,0.0,0.0,3.0,Febre/ Tosse/ Cefaleia,0.0,0.0,0.0,1.0,0.0,0.0,0.0,0.0,0.0,0.0,0.0,0.0,1.0,0.0,0.0,0.0,0.0,0.0,1.0,0.0,0.0,0.0,0.0,0.0,"Febre, Tosse, Cefaleia",2020-05-01,2020-05-07,6.0,0.0,6.0,2020-05-01,1.0,2020-05-07,503.0,503.0,PCR-Swab Nasal,Inpatient,0.0,0.0,,6.0,0.0,0.0,1.0,,327.0,Nao,,Nao,1.0,1.0,0.0,0.0,0.0,0.0,0.0,TAC-MFS,"Reducao de inibidores de Calcineurina (TAC, CsA), Suspensao MMF",1.0,0.0,0.0,1.0,,,,,,,,,,,1.0,"Cortico-esteroides em altas doses, Piperacilina-Tazobactan",1.0,Sim,1.0,Nao,,Nao,Nao,,Nao realizou radiografia de torax / Nao informado,,Opacidades em vidro fosco,1.0,,,,,118.0,96.0,,,1012.0,,,,,,,Sim,,Nao,Nao,,60.0,Masculino,2018-05-29,85.0,176.0,,UTI geral,TCE,Sim,Sim,Sim,Nao realizada,,Nao,Nao,,19.0,20.0,,,26.0,,,,2020-05-14,Nao,,,Nao,,,Nao,Nao,41.0,69.0,,,711.0,1.0
2021-04-23,Sim,,Sim,Confirmado,HUWC-28-EACP,128276-2320,"IMPERATRIZ, MA",MA,Nordeste,EACP,Female,1958-09-05,62.0,1.0,White,73.0,160.0,28.52,Carcinoma Hepatocelular  (CHC),2015-11-12,5.44558521560575,65.347022587269,HUWC/UFC,Diabetes Mellitus Tipo 1 ou Tipo 2,Sem dados,,0.0,1.0,0.0,0.0,0.0,0.0,0.0,0.0,0.0,0.0,0.0,1.0,Febre/ Tosse/ Alteracao do olfato/ Alteracao do paladar,0.0,0.0,0.0,1.0,0.0,0.0,0.0,0.0,0.0,0.0,0.0,1.0,1.0,0.0,1.0,0.0,0.0,0.0,0.0,0.0,0.0,0.0,0.0,0.0,"Febre, Tosse, Dispneia, Fadiga, Alteracao do olfato, Alteracao do paladar",2020-06-02,2020-06-03,1.0,2.0,-1.0,2020-06-04,1.0,2020-06-03,471.0,469.0,PCR-Swab Nasal,Inpatient,1.0,5.0,13.0,1.0,27.0,0.0,1.0,,324.0,Sim - com pronacao,2020-06-14,Nao,1.0,1.0,0.0,0.0,0.0,0.0,0.0,TAC-MFS,"Reducao de inibidores de Calcineurina (TAC, CsA), Suspensao MMF",1.0,0.0,0.0,1.0,,,,,,,,,,,1.0,"Cortico-esteroides em altas doses, Imunoglobulina, Azitromicina, Ceftriaxone, Meropenem, Vancomicina, Fluconazo",1.0,Sim,1.0,Nao,,Nao,Nao,,Nao realizou radiografia de torax / Nao informado,,Opacidades em vidro fosco,1.0,,,,,40.0,40.0,1.0,,100.0,,,1.0,,,,Nao,,Nao informado,Nao informado,,28.0,Masculino,2015-11-12,80.0,190.0,4.0,UTI geral,TCE,Sim,Sim,Sim,Nao realizada,,Nao,Nao,,67.0,44.0,,,13.0,,,,2020-06-30,Nao,,,Nao,,,Nao,Nao,16.0,18.0,,,16.0,1.0
2021-03-24,Sim,,Sim,Confirmado,HUWC-2-EMP,115963-2320,"Fortaleza, CE",CE,Nordeste,EMP,Male,1953-08-24,68.0,1.0,Mixed race,83.0,180.0,25.62,Hepatite C,2014-08-31,6.562628336755647,78.75154004106776,HUWC/UFC,"Diabetes Mellitus Tipo 1 ou Tipo 2, TROBOFILIA",Nao usava,No,0.0,1.0,0.0,0.0,0.0,0.0,0.0,0.0,0.0,0.0,0.0,1.0,Febre/ Tosse/ Mialgia,0.0,0.0,0.0,1.0,0.0,0.0,0.0,0.0,0.0,0.0,0.0,0.0,1.0,1.0,0.0,0.0,0.0,0.0,0.0,0.0,0.0,0.0,0.0,0.0,"Febre, Tosse, Mialgia",2020-05-03,2020-05-06,3.0,4.0,,2020-05-07,1.0,,501.0,497.0,PCR-Swab Nasal,Outpatient,,0.0,,,0.0,0.0,1.0,,322.0,Paciente nao foi internado,,,1.0,1.0,0.0,0.0,0.0,0.0,0.0,TAC-MFS,"Reducao de inibidores de Calcineurina (TAC, CsA), Suspensao MMF",1.0,0.0,0.0,1.0,,,,,,,,,,,1.0,,0.0,Nao,0.0,Nao,,Nao,Nao,,Nao realizou radiografia de torax / Nao informado,,Nao realizou Tomografia de torax / Nao informado,,,,,,,,,,,,,,,,,Nao,,,,,32.0,Masculino,2014-08-31,,,,UTI geral,,,,,Nao realizada,,Nao,Nao,,,,,,,,,,,Nao,,,Nao,,,Nao,Nao,12.0,16.0,,54.0,21.0,1.0
2021-06-27,Sim,,Sim,Confirmado,ICDF-12-WAL,2672015320,"BRASILIA, DF",DF,Centro-Oeste / DF,WAL,Male,1962-01-29,59.0,0.0,Mixed race,,,,NASH,2021-04-08,0.2190280629705681,2.628336755646817,ICDF,"Hipertensao, Diabetes Mellitus Tipo 1 ou Tipo 2, Cardiopatia",Nao usava,No,1.0,1.0,0.0,0.0,0.0,1.0,0.0,0.0,0.0,0.0,,3.0,Dispneia,0.0,0.0,0.0,0.0,0.0,0.0,0.0,0.0,0.0,0.0,0.0,0.0,0.0,0.0,0.0,0.0,0.0,0.0,0.0,0.0,0.0,0.0,1.0,0.0,Dispneia,2021-04-08,2021-04-08,0.0,0.0,0.0,2021-04-08,2.0,2021-04-08,161.0,161.0,PCR-Swab Nasal,Inpatient,1.0,9.0,,1.0,8.0,0.0,1.0,,80.0,Nao,,Sim,1.0,0.0,0.0,0.0,0.0,0.0,0.0,TAC,"Reducao de inibidores de Calcineurina (TAC, CsA), Suspensao MMF",1.0,0.0,,,,,,,,,,,,,1.0,Cortico-esteroides em altas doses,1.0,Sim,1.0,Sim,22/06/2021,,,,Nao realizou radiografia de torax / Nao informado,,Nao realizou Tomografia de torax / Nao informado,,,,81.0,,39.0,35.0,,164.0,206.0,,,,134.0,,,Nao,,Sim,Nao,,33.0,Masculino,2021-04-07,73.0,163.0,,UTI geral,TCE,,,,Nao realizada,,Nao,Nao,,,,,,,,,,,Nao,,,,,,,,,,,,,1.0
2021-06-27,Sim,,Sim,Confirmado,ICDF-18-PVJ,2424575320,"BRASILIA, DF",DF,Centro-Oeste / DF,PVJ,Male,1955-03-03,66.0,1.0,White,,,,"Re-Transplante - Hepatite C, REJEICAO CRONICA",2020-03-05,1.3114305270362765,15.737166324435318,ICDF,,Nao usava,,0.0,0.0,0.0,0.0,0.0,0.0,0.0,0.0,0.0,0.0,,0.0,Dispneia/ Fadiga,0.0,0.0,0.0,0.0,0.0,0.0,0.0,0.0,0.0,0.0,1.0,0.0,0.0,0.0,0.0,0.0,0.0,0.0,0.0,0.0,0.0,0.0,1.0,0.0,"Febre, Dispneia, Fadiga",2021-04-12,2021-04-12,0.0,0.0,13.0,2021-04-12,2.0,2021-04-25,157.0,157.0,PCR-Swab Nasal,Inpatient,0.0,0.0,,,0.0,0.0,1.0,,76.0,Nao,,Nao,1.0,0.0,0.0,0.0,0.0,0.0,0.0,TAC,"Reducao de inibidores de Calcineurina (TAC, CsA), Suspensao MMF",1.0,0.0,,,,,,,,,,,,,1.0,,0.0,Sim,1.0,,,,Nao,,Nao realizou radiografia de torax / Nao informado,,Opacidades em vidro fosco,1.0,,,,,,,,,,,,,,,,Sem infromacoes,6.0,Nao informado,Nao informado,,52.0,Masculino,2020-03-04,70.0,153.0,,UTI geral,TCE,,,,Nao realizada,,Nao,Nao,,,,,,,,,,2021-05-05,Nao,,,Nao,,,,,,,,,,1.0
2021-06-18,Sim,,Sim,Confirmado,HGG -1 - JOSC,2539145220,"GOIANIA, GO",GO,Centro-Oeste / DF,JOSC,Male,1955-10-12,65.0,1.0,White,96.0,176.0,30.99,"Carcinoma Hepatocelular  (CHC), NASH",2020-08-12,0.8487337440109514,10.184804928131417,HOSPITAL GERAL DE GOIANIA - HGG,Diabetes Mellitus Tipo 1 ou Tipo 2,Nao usava,No,0.0,1.0,0.0,0.0,0.0,0.0,0.0,0.0,0.0,0.0,1.0,1.0,Febre/ Dispneia,0.0,0.0,0.0,0.0,0.0,0.0,0.0,0.0,0.0,0.0,0.0,0.0,1.0,0.0,0.0,0.0,0.0,0.0,0.0,0.0,0.0,0.0,1.0,0.0,Dor toracica,2020-08-15,2020-08-12,-3.0,5.0,-8.0,2020-08-20,1.0,2020-08-12,19.0,14.0,PCR-Swab Nasal,Inpatient,1.0,2.0,2.0,12.0,12.0,1.0,2.0,2020-09-03,22.0,Nao,2020-09-02,Sim,1.0,1.0,0.0,0.0,0.0,0.0,0.0,TAC-MFS,"Reducao de inibidores de Calcineurina (TAC, CsA), Reducao MMF",1.0,0.0,1.0,0.0,,,,,,,,,,,1.0,"Cortico-esteroides em altas doses, Heparina",1.0,Sim,1.0,,,,,,Anormalidades intersticiais,1.0,Opacidades em vidro fosco,1.0,1132,,163000.0,,46.0,81.0,,282.0,1082.0,,,,130.0,0.0,,Sim,,Nao,Nao,,38.0,Masculino,2020-08-12,80.0,175.0,7.0,UTI geral,TCE,Sim,Sim,Nao,Nao realizada,98.0,Nao,Sim,PCR,58.0,32.0,,292.0,23.0,,,,,Sim,03/09/2020,1.0,Nao,,,,,,,,,,1.0
2021-07-30,Sim,,Sim,Confirmado,HL- FSC,266786-5,"Sao Paulo, SP",SP,Sudeste,FSC,Male,1981-05-22,40.0,0.0,Mixed race,55.0,168.0,19.49,Auto-imune,2020-05-29,1.1690622861054072,14.028747433264886,H Leforte,"Hipertensao, Diabetes Mellitus Tipo 1 ou Tipo 2",Nao usava,No,0.0,1.0,0.0,0.0,0.0,1.0,0.0,0.0,0.0,0.0,0.0,2.0,Febre/ Cefaleia/ Mialgia,0.0,0.0,0.0,0.0,0.0,0.0,0.0,0.0,0.0,0.0,0.0,0.0,1.0,1.0,0.0,0.0,0.0,0.0,1.0,0.0,0.0,0.0,0.0,0.0,"Cefaleia, Mialgia",2020-09-04,2020-09-05,1.0,1.0,,2020-09-05,1.0,,377.0,376.0,PCR-Swab Nasal,Outpatient,,0.0,,1.0,0.0,0.0,1.0,,328.0,Paciente nao foi internado,,Paciente nao foi internado,1.0,0.0,0.0,1.0,0.0,0.0,0.0,TAC-PRED,"Reducao de inibidores de Calcineurina (TAC, CsA)",1.0,0.0,,,,,0.0,0.0,,,,,,,1.0,"Amoxicilina + Clavulanato, Vitamina D, Vitamina C",1.0,Sim,1.0,Nao,,Nao,Nao,,Nao realizou radiografia de torax / Nao informado,,Nao realizou Tomografia de torax / Nao informado,,4524 - 26,,311000.0,,26.0,41.0,,130.0,146.0,,,,140.0,,,Nao,10.0,Nao,Nao,,18.0,Feminino,2020-05-28,86.0,170.0,3.0,UTI geral,AVC (hemorragico ou isquemico),Sim,Não,Nao,Nao realizada,100.0,Nao,Sim,,27.0,28.0,,58.0,40.0,,,,,Nao,,,Nao,,,Nao,Nao,19.0,25.0,,,145.0,1.0
2021-01-24,Sim,,Sim,Confirmado,HQD-1-MRM,246017-3320,"Rio de Janeiro, RJ",RJ,Sudeste,MRM,Male,1981-09-07,39.0,0.0,Mixed race,95.0,180.0,29.32,Colangite Esclerosante Secundaria / Colangite Repeticao,2020-04-17,0.7720739219712526,9.264887063655031,Hospital Quinta Dor / Equipe Lucio Pacheco,,Nao usava,No,0.0,0.0,0.0,0.0,0.0,0.0,0.0,0.0,0.0,0.0,0.0,0.0,Febre/ Fadiga,0.0,0.0,0.0,0.0,0.0,0.0,0.0,0.0,0.0,0.0,1.0,0.0,1.0,0.0,0.0,0.0,0.0,0.0,0.0,0.0,0.0,0.0,0.0,0.0,Dispneia,2020-05-22,2020-04-17,-35.0,0.0,-35.0,2020-05-22,1.0,2020-04-17,33.0,33.0,PCR-Swab Nasal,Inpatient,1.0,30.0,27.0,14.0,18.0,1.0,2.0,2020-06-24,68.0,Sim - sem pronacao,2020-05-28,Sim,1.0,0.0,0.0,1.0,0.0,0.0,0.0,TAC-PRED,"Reducao de inibidores de Calcineurina (TAC, CsA)",1.0,0.0,,,,,0.0,0.0,,,,,,,1.0,Oxido Nitrico,1.0,Sim,1.0,,,,,,Nao realizou radiografia de torax / Nao informado,,Opacidades em vidro fosco,1.0,661 - 2.9,,268000.0,,141.0,158.0,,993.0,1270.0,,,,137.0,,7544.0,Sim,,Sim,Nao,,25.0,Masculino,2020-04-16,90.0,180.0,3.0,UTI geral,TCE,Sim,Não,Nao,Nao realizada,,Nao,Sim,,450.0,260.0,,34.0,36.0,,,,,Sim,17/06/2020,4.0,Nao,,,,,,,,,,1.0
2021-03-30,Sim,,Sim,Confirmado,HSC-11-SPA,2257792320,"Fortaleza, CE",CE,Nordeste,SPA,Male,1955-05-21,66.0,1.0,Mixed race,65.0,160.0,25.39,Criptogenica,2020-02-07,1.1416837782340863,13.700205338809035,Hospital Sao Carlos - HSC,Diabetes Mellitus Tipo 1 ou Tipo 2,Nao usava,Ex-smoker,0.0,1.0,0.0,0.0,0.0,0.0,0.0,0.0,0.0,0.0,0.0,1.0,Tosse/ Dispneia/ Cefaleia/ Mialgia/ Diarreia/ Anorexia,0.0,0.0,0.0,1.0,0.0,0.0,0.0,0.0,0.0,0.0,0.0,0.0,0.0,1.0,0.0,1.0,0.0,0.0,1.0,0.0,0.0,1.0,1.0,0.0,"Tosse, Dispneia, Cefaleia, Mialgia, Diarreia, Anorexia",2020-05-20,2020-05-26,6.0,9.0,5.0,2020-05-29,1.0,2020-06-03,484.0,475.0,PCR-Swab Nasal,Inpatient,0.0,0.0,,10.0,5.0,0.0,1.0,,308.0,Nao,,Nao,1.0,0.0,0.0,1.0,0.0,0.0,0.0,TAC-PRED,"Reducao de inibidores de Calcineurina (TAC, CsA)",1.0,0.0,,,,,0.0,0.0,,,,,,,1.0,"Azitromicina, Cortico-esteroides em altas doses",1.0,Sim,1.0,Nao,,Sem informacao,Nao,,Radiografia normal,0.0,Nao realizou Tomografia de torax / Nao informado,,6300 - 1215,,80500.0,,15.0,27.0,,,80.0,,,,,,,Nao,,Nao,Nao,,32.0,Masculino,2020-02-06,65.0,165.0,,UTI geral,TCE,Sim,Não,Nao,Nao realizada,,Nao,Nao,,103.0,177.0,,55.0,38.0,,,,2020-06-10,Nao,,,,,,Nao,Nao,24.0,32.0,,236.0,20.0,1.0
2021-03-26,Sim,,Sim,Confirmado,HUWC- 9- RRC,,"BOA VISTA, RR",RR,Nordeste,RRC,Female,1986-06-25,35.0,0.0,Mixed race,52.0,156.0,21.37,Auto-imune,2008-01-30,13.152635181382614,157.83162217659137,HUWC/UFC,,Nao usava,No,0.0,0.0,0.0,0.0,0.0,0.0,0.0,0.0,0.0,0.0,0.0,0.0,Febre/ Cefaleia/ Congestao nasal/ Fadiga/ Mialgia/ Diarreia,0.0,0.0,0.0,0.0,0.0,0.0,0.0,0.0,0.0,0.0,1.0,0.0,1.0,1.0,0.0,0.0,0.0,0.0,1.0,1.0,0.0,1.0,0.0,0.0,"Febre, Coriza, Cefaleia, Fadiga, Diarreia, DOR ABDOMINAL",2020-05-13,2020-05-13,0.0,2.0,,2020-05-15,1.0,,491.0,489.0,Sorologia,Outpatient,,0.0,,,0.0,0.0,1.0,,317.0,Nao,,Nao,1.0,0.0,0.0,1.0,0.0,0.0,0.0,TAC-PRED,"Reducao de inibidores de Calcineurina (TAC, CsA)",1.0,0.0,,,,,0.0,0.0,,,,,,,1.0,,0.0,Sim,1.0,Nao,,Nao,Nao,,Nao realizou radiografia de torax / Nao informado,,Nao realizou Tomografia de torax / Nao informado,,2500 - 25,,143000.0,,79.0,151.0,,,,,,,140.0,,,Nao,,Nao,Nao,,44.0,,,,,,,,,Não,Nao,Nao realizada,,Nao,Nao,,,,,,,,,,,Nao,,,Nao,,,Nao,Nao,36.0,56.0,,,77.0,1.0